Roberts, Texas
type: Concept
in scheme: scheme
broader: Hunt County, Texas
change note:
  comment: initial version
  created: 2019-01-23T08:25:32-06:00
  creator: Diana Dulek
definition: See Handbook of Texas Online entry (accessed 2019-01-23): https://tshaonline.org/handbook/online/articles/hvr53