Roosevelt, Theodore, Jr.
type: Concept
member of: lcnaf
member of: viaf
in scheme: scheme
broader: Person
change note:
  comment: initial version
  created: 2022-09-09T11:04:33-05:00
  creator: Laura Ramirez
editorial note: Source: Joseph S. Cullinan Papers.
scope note: Use for the son of President Theodore Roosevelt, not the President himself.