Young, James
type: Concept
in scheme: scheme
broader: Person
change note:
  comment: initial version
  created: 2020-09-30T09:43:01-05:00
  creator: Laura Ramirez
definition: See Handbook of Texas Online entry (accessed 2020-09-30): https://www.tshaonline.org/handbook/entries/young-james
editorial note: Source: Minnie Fisher Cunningham Papers.