Clarks and Courts Printing
type: Concept
in scheme: scheme
broader: Organization
change note:
  comment: initial version
  created: 2020-08-07T16:33:03-05:00
  creator: Christin Zepeda
definition: See Handbook of Texas Online entry (accessed 2020-08-07): https://tshaonline.org/handbook/online/articles/ehcgy