Swartout, Texas
type: Concept
member of: geonames
member of: tgn
in scheme: scheme
alternative label: Swartwout, Texas
broader: Polk County, Texas
change note:
  comment: initial version
  created: 2022-09-12T15:25:59-05:00
  creator: Laura Ramirez
definition: See Handbook of Texas Online entry (accessed 2022-09-12): https://tshaonline.org/handbook/online/articles/hts24