De la Garza, José Antonio
type: Concept
in scheme: scheme
broader: Person
change note:
  comment: initial version
  created: 2021-07-30T12:19:43-05:00
  creator: Laura Ramirez
definition: See Handbook of Texas Online entry (accessed 2021-07-30): https://www.tshaonline.org/handbook/entries/garza-jose-antonio-de-la
editorial note: Source: Mexico Documents Collection.