Jordan, Barbara C.
type: Concept
member of: lcnaf
member of: viaf
in scheme: scheme
broader: Person
change note:
  comment: initial version
  created: 2021-05-11T14:48:15-05:00
  creator: Laura Ramirez
definition: See Handbook of Texas Online entry (accessed 2021-05-11): https://www.tshaonline.org/handbook/entries/jordan-barbara-charline
editorial note: Source: UH Photographs Collection.