Jones, Mary S.
type: Concept
in scheme: scheme
broader: Person
change note:
  comment: initial version
  created: 2019-11-20T16:37:20-06:00
  creator: Christin Zepeda
definition: See Handbook of Texas Online entry (accessed 2019-11-19): https://tshaonline.org/handbook/online/articles/fjo93
editorial note: Source: Mary (Mrs. Anson) Jones Letters.