Stravato, Claudia, 1942-
type: Concept
member of: orcid
in scheme: scheme
broader: Person
change note:
  comment: initial version
  created: 2017-04-11T13:32:41-05:00
  creator: Diana Dulek
change note:
  comment: Added source to Editorial Note.
  creator: Laura Ramirez
  modified: 2017-11-09T09:27:34-06:00
change note:
  comment: Added year to name.
  creator: Susan Hoover
  modified: 2026-02-05T12:22:19-06:00
definition: Source: Sharing Stories from 1977: Putting the National Women’s Conference on the Map Collection
editorial note: Source: Marjorie Randal National Women's Conference Collection.