Ross, Reuben
type: Concept
in scheme: scheme
broader: Person
change note:
  comment: initial version
  created: 2019-01-15T13:46:00-06:00
  creator: Christin Zepeda
definition: See Handbook of Texas Online entry (accessed 2019-01-15): https://tshaonline.org/handbook/online/articles/fro84
editorial note: Source: George Fuermann "Texas and Houston" Collection.