Pan American Round Table (Texas)
type: Concept
in scheme: scheme
broader: Organization
related: San Antonio, Texas
change note:
  comment: initial version
  created: 2022-01-19T14:55:01-06:00
  creator: Laura Ramirez
definition: See Handbook of Texas Online entry (accessed 2022-01-19): https://www.tshaonline.org/handbook/entries/pan-american-round-table