Battle of San Jacinto (1836)
type: Concept
member of: lcsh
in scheme: scheme
broader: Concept
related: Texas
change note:
  comment: Updated prefLabel. Changed from "San Jacinto, Battle of, Tex., 1836" to "Battle of San Jacinto (1836)." Added related term "Texas."
  creator: Laura Ramirez
  modified: 2022-09-14T17:21:44-05:00
definition: See Handbook of Texas Online entry (accessed 2022-09-14): https://www.tshaonline.org/handbook/entries/san-jacinto-battle-of