Filísola, Vicente
type: Concept
member of: lcnaf
member of: viaf
in scheme: scheme
broader: Person
change note:
  comment: initial version
  created: 2021-07-23T11:57:38-05:00
  creator: Laura Ramirez
definition: See Handbook of Texas Online entry (accessed 2021-07-23): https://www.tshaonline.org/handbook/entries/filisola-vicente
editorial note: Source: Mexico Documents Collection.