Dealey, George B.
type: Concept
member of: lcnaf
member of: viaf
in scheme: scheme
broader: Person
change note:
  comment: initial version
  created: 2022-09-09T09:03:07-05:00
  creator: Christin Zepeda
definition: See Handbook of Texas Online entry (accessed 2022-09-09): https://www.tshaonline.org/handbook/entries/dealey-george-bannerman
editorial note: Source: Joseph S. Cullinan Papers.