Sandusky, William H.
type: Concept
in scheme: scheme
broader: Person
change note:
  comment: initial version
  created: 2020-08-07T16:45:33-05:00
  creator: Christin Zepeda
definition: See Handbook of Texas Online entry (accessed 2020-08-07: https://tshaonline.org/handbook/online/articles/fsa25
editorial note: Source: Rare Books and Maps Collection.