Lewis, Guy Vernon, II
type: Concept
in scheme: scheme
broader: Person
related: University of Houston Athletics, University of Houston
change note:
  comment: initial version
  created: 2021-05-12T12:22:58-05:00
  creator: Laura Ramirez
definition: See Handbook of Texas Online entry (accessed 2021-05-11): https://www.tshaonline.org/handbook/entries/lewis-guy-vernon
editorial note: Source: UH Photographs Collection.