Church of the Annunciation
type: Concept
in scheme: scheme
related: Houston, Texas
broader: Church buildings
change note:
  comment: initial version
  created: 2020-03-05T14:04:19-06:00
  creator: Christin Zepeda
definition: See Handbook of Texas Online entry (accessed 2020-03-05): https://tshaonline.org/handbook/online/articles/ivc01