Hirsch, Maurice
type: Concept
in scheme: scheme
broader: Person
change note:
  comment: initial version
  created: 2019-03-13T11:55:50-05:00
  creator: Christin Zepeda
definition: See Handbook of Texas Online entry (accessed 2019-03-12): https://tshaonline.org/handbook/online/articles/fhi40
editorial note: Source: Janice Rubin Photographs.