Fleming, Lamar, Jr.
type: Concept
in scheme: scheme
broader: Person
change note:
  comment: initial version
  created: 2020-08-04T13:56:11-05:00
  creator: Christin Zepeda
definition: See Handbook of Texas Online entry (accessed 2020-08-04): https://tshaonline.org/handbook/online/articles/ffl09
editorial note: Source: UH Photographs Collection.