Lovett, Edgar Odell, 1871-1957
type: Concept
member of: lcnaf
member of: viaf
in scheme: scheme
broader: Person
change note:
  comment: initial version
  created: 2025-08-14T16:10:01-05:00
  creator: Leonard Martin
definition: See Handbook of Texas Online entry (accessed 2025-08-14): https://www.tshaonline.org/handbook/entries/lovett-edgar-odell
editorial note: Source: Museum of Fine Arts, Houston, Texas Art Project Microfilm