Velasco, Texas
type: Concept
member of: geonames
in scheme: scheme
broader: Brazoria County, Texas
change note:
  comment: initial version
  created: 2019-01-08T12:26:58-06:00
  creator: Diana Dulek
change note:
  comment: Added term to GeoNames collection.
  creator: Diana Dulek
  modified: 2019-01-28T12:51:54-06:00
definition: See Handbook of Texas Online entry (accessed 2019-01-08): https://tshaonline.org/handbook/online/articles/hvv07