Texana, Texas
type: Concept
member of: lcnaf
member of: viaf
in scheme: scheme
broader: Jackson County, Texas
change note:
  comment: initial version
  created: 2022-09-12T15:36:53-05:00
  creator: Laura Ramirez
definition: See Handbook of Texas Online entry (accessed 2022-09-12): https://www.tshaonline.org/handbook/entries/texana-tx