Sakowitz, Simon
type: Concept
in scheme: scheme
broader: Person
related: Board of Regents, University of Houston
change note:
  comment: initial version
  created: 2021-05-11T10:00:27-05:00
  creator: Laura Ramirez
definition: See Handbook of Texas Online entry (accessed 2021-05-11): https://www.tshaonline.org/handbook/entries/sakowitz-simon
editorial note: Source: UH Photographs Collection.