Republic of Texas, 1836-1846
type: Concept
member of: fast
member of: lcsh
in scheme: scheme
broader: Time Period
change note:
  comment: initial version
  created: 2022-09-13T11:38:56-05:00
  creator: Laura Ramirez
definition: See Handbook of Texas Online entry (accessed 2022-09-13): https://www.tshaonline.org/handbook/entries/republic-of-texas