Crystal Lake
type: Concept
in scheme: scheme
related: Anderson County, Texas
broader: Lakes
change note:
  comment: initial version
  created: 2019-01-28T12:08:01-06:00
  creator: Diana Dulek
definition: See Handbook of Texas Online entry (accessed 2019-01-28): https://tshaonline.org/handbook/online/articles/roc29