Fort Worth Star-Telegram
type: Concept
member of: lcnaf
member of: viaf
in scheme: scheme
broader: Organization
related: Fort Worth Record
change note:
  comment: initial version
  created: 2020-09-23T15:47:17-05:00
  creator: Laura Ramirez
definition: See Handbook of Texas Online entry (accessed 2020-23-09): https://www.tshaonline.org/handbook/entries/fort-worth-star-telegram