Wiess Bluff, Texas
type: Concept
member of: geonames
in scheme: scheme
broader: Jasper County, Texas
change note:
  comment: initial version
  created: 2022-09-13T09:01:32-05:00
  creator: Laura Ramirez
definition: See Handbook of Texas Online entry (accessed 2022-09-13): https://www.tshaonline.org/handbook/entries/wiess-bluff-tx