Hermitage, Texas
type: Concept
in scheme: scheme
broader: Cass County, Texas
change note:
  comment: initial version
  created: 2019-01-07T12:48:00-06:00
  creator: Diana Dulek
definition: See Handbook of Texas Online entry (accessed 2019-01-07): https://tshaonline.org/handbook/online/articles/hvh50