Cutrer, Lewis W.
type: Concept
in scheme: scheme
broader: Person
change note:
  comment: initial version
  created: 2017-11-21T12:31:23-06:00
  creator: Diana Dulek
change note:
  comment: This term was previously "Lee, Thomas R." Reassigned to "Cutrer, Lewis W." to eliminate duplicate entry. Changed Source from "University of Houston Electronic Theses and Dissertations" to "Mary F. Lopez Papers." Added Handbook of Texas Online entry to Definitions.
  creator: Christin Zepeda
  modified: 2019-03-14T13:33:13-05:00
definition: See Handbook of Texas Online entry (accessed 2019-03-14): https://tshaonline.org/handbook/online/articles/fcu40
editorial note: Source: Mary F. Lopez Papers.