Space architecture
type: Concept
in scheme: scheme
alternative label: Aerospace architecture
broader: Concept
related: Smitherman, David
change note:
  comment: initial version
  created: 2020-07-22T16:59:48-05:00
  creator: Laura Ramirez
definition: Space architecture is work relating to the theory, practice and knowledge of architecture and engineering required to design and build habitable systems in outer space or other extreme environments. See University of Houston’s News & Events “Space Architecture: From Outer Space to the Ocean Floor” entry (accessed 2020-07-24): https://uh.edu/news-events/stories/2015/September/0915SpaceArchitecture.php