Litter (Trash)
type: Concept
member of: lcsh
in scheme: scheme
broader: Concept
change note:
  comment: initial version
  created: 2024-05-07T12:02:36-05:00
  creator: Susan Hoover
scope note: Use for unwanted materials that are disposed of improperly, e.g. paper dropped on the ground or thrown out of a car window. For food scraps and kitchen grease, see Household waste.