Transmedial art
type: Concept
member of: aat
in scheme: scheme
broader: Concept
change note:
  comment: initial version
  created: 2023-02-15T17:20:10-06:00
  creator: Susan Hoover
scope note: Distinguished from mixed media, multimedia, and intermedial art.