Nuevo Santander
type: Concept
in scheme: scheme
broader: Concept
related: North and Central America
change note:
  comment: initial version
  created: 2021-07-30T14:17:00-05:00
  creator: Laura Ramirez
definition: See Handbook of Texas Online entry (accessed 2021-07-30): https://www.tshaonline.org/handbook/entries/nuevo-santander