Texas Industrial Commission
type: Concept
member of: lcnaf
member of: viaf
in scheme: scheme
broader: Organization
change note:
  comment: initial version
  created: 2022-11-22T16:10:46-06:00
  creator: Laura Ramirez
definition: See Handbook of Texas Online entry (accessed 2022-11-21): https://www.tshaonline.org/handbook/entries/texas-industrial-commission