Hobby, Oveta C.
type: Concept
member of: lcnaf
member of: viaf
in scheme: scheme
alternative label: Hobby, William Pettus, Mrs.
broader: Person
change note:
  comment: initial version
  created: 2020-09-23T14:44:41-05:00
  creator: Laura Ramirez
definition: See Handbook of Texas Online entry (accessed 2020-23-09): https://www.tshaonline.org/handbook/entries/hobby-oveta-culp
editorial note: Source: Minnie Fisher Cunningham Papers.