Clark, Edward A.
type: Concept
in scheme: scheme
broader: Person
change note:
  comment: initial version
  created: 2022-11-22T15:33:58-06:00
  creator: Laura Ramirez
definition: See Handbook of Texas Online entry (accessed 2022-11-21): https://www.tshaonline.org/handbook/entries/clark-edward-aubrey
editorial note: Source: Governor James V. Allred Papers.