New Washington, Texas
type: Concept
in scheme: scheme
broader: Harris County, Texas
change note:
  comment: initial version
  created: 2019-01-07T08:14:23-06:00
  creator: Diana Dulek
change note:
  creator: Christin Zepeda
  modified: 2022-09-26T09:36:54-05:00
definition: See Handbook of Texas Online entry (accessed 2019-01-07): https://tshaonline.org/handbook/online/articles/hvn28