Houston Art League
type: Concept
member of: lcnaf
member of: viaf
in scheme: scheme
broader: Organization
change note:
  comment: initial version
  created: 2025-08-14T16:30:25-05:00
  creator: Leonard Martin
definition: See Handbook of Texas Online entry (accessed 2025-08-14): https://www.tshaonline.org/handbook/entries/fall-florence-king-long
editorial note: Source: Museum of Fine Arts, Houston, Texas Art Project Microfilm