Hershey, Terese Tarlton
type: Concept
member of: lcnaf
member of: viaf
in scheme: scheme
alternative label: Hershey, Terry
broader: Person
change note:
  comment: initial version
  created: 2022-08-21T18:03:31-05:00
  creator: Christin Zepeda
change note:
  comment: Added altLabel "Hershey, Terry." Added definition from Handbook of Texas Online.
  creator: Susan Hoover
  modified: 2024-05-03T18:01:11-05:00
definition: See Handbook of Texas Online entry (accessed 2024-05-06): https://www.tshaonline.org/handbook/entries/terese-tarlton-hershey
editorial note: Source: Oral Histories - Houston History Project.
editorial note: Source: Dee Maner Papers.