Houston Post
type: Concept
in scheme: scheme
broader: Organization
change note:
  comment: initial version
  created: 2019-01-29T13:33:42-06:00
  creator: Christin Zepeda
definition: See Handbook of Texas Online entry (accessed 2019-01-29): https://tshaonline.org/handbook/online/articles/eeh04