William Cameron and Company, Inc.
type: Concept
in scheme: scheme
broader: Organization
change note:
  comment: initial version
  created: 2022-09-09T08:43:22-05:00
  creator: Christin Zepeda
definition: Organization mentioned in Handbook of Texas Online entry (accessed 2022-09-09): https://www.tshaonline.org/handbook/entries/cameron-william-waldo
editorial note: Source: Joseph S. Cullinan Papers.