Houston Defender (Newspaper)
type: Concept
in scheme: scheme
broader: Organization
change note:
  comment: initial version
  created: 2022-09-09T12:36:34-05:00
  creator: Christin Zepeda
definition: See Handbook of Texas Online entry (accessed 2022-09-09): https://www.tshaonline.org/handbook/entries/houston-defender