Fort Sullivan
type: Concept
in scheme: scheme
broader: Concept
related: Milam County, Texas
change note:
  comment: initial version
  created: 2019-01-08T10:37:28-06:00
  creator: Diana Dulek
definition: See Handbook of Texas Online entry (accessed 2019-01-08): https://tshaonline.org/handbook/online/articles/uef17