Houston Press (Newspaper)
type: Concept
in scheme: scheme
broader: Organization
related: Houston, Texas
change note:
  comment: initial version
  created: 2022-09-09T12:19:22-05:00
  creator: Laura Ramirez
definition: See Handbook of Texas Online entry (accessed 2022-09-09): https://www.tshaonline.org/handbook/entries/houston-press
editorial note: Source: Joseph S. Cullinan Papers.