Bates, William B.
type: Concept
in scheme: scheme
broader: Person
change note:
  comment: initial version
  created: 2018-06-20T08:25:11-05:00
  creator: Diana Dulek
change note:
  comment: Added Handbook of Texas definition to term.
  creator: Laura Ramirez
  modified: 2021-05-05T12:32:31-05:00
definition: See Handbook of Texas Online entry (accessed 2021-05-05): https://www.tshaonline.org/handbook/entries/bates-william-bartholomew
editorial note: Source: KUHT Film and Video.