Political Association of Spanish-Speaking Organizations
type: Concept
in scheme: scheme
broader: Organization
change note:
  comment: initial version
  created: 2017-11-13T13:23:45-06:00
  creator: Diana Dulek
change note:
  comment: This term was previously "Shi, Larry." Reassigned to "Political Association of Spanish-Speaking Organizations" to eliminate duplicate entry. Deleted Source "University of Houston Electronic Theses and Dissertations" from Editorial notes. Added Handbook of Texas Online entry to Definitions.
  creator: Christin Zepeda
  modified: 2019-03-14T13:50:07-05:00
definition: See Handbook of Texas Online entry (accessed 2019-03-14): https://tshaonline.org/handbook/online/articles/vep01