Texas Fine Arts Association
type: Concept
member of: lcnaf
member of: viaf
in scheme: scheme
broader: Organization
related: Austin, Texas
change note:
  comment: initial version
  created: 2025-03-07T11:57:21-06:00
  creator: Laura Ramirez
definition: See Handbook of Texas Online entry (accessed 2025-03-05): https://www.tshaonline.org/handbook/entries/texas-fine-arts-association