Hannah, Mack H., Jr.
type: Concept
in scheme: scheme
broader: Person
change note:
  comment: initial version
  created: 2018-05-31T09:18:18-05:00
  creator: Diana Dulek
change note:
  comment: Added Handbook of Texas definition to term.
  creator: Laura Ramirez
  modified: 2021-05-05T12:44:49-05:00
definition: See Handbook of Texas Online entry (accessed 2021-05-05): https://www.tshaonline.org/handbook/entries/hannah-mack-henry-jr
editorial note: Source: This Is Our Home, It Is Not For Sale Film Collection.