Cox, George W.
type: Concept
member of: lcnaf
member of: viaf
in scheme: scheme
broader: Person
change note:
  comment: initial version
  created: 2022-11-21T16:22:27-06:00
  creator: Laura Ramirez
definition: See Handbook of Texas Online entry (accessed 2022-11-21): https://www.tshaonline.org/handbook/entries/cox-george-washington
editorial note: Source: Governor James V. Allred Papers.