Texas Equal Suffrage Association
type: Concept
in scheme: scheme
broader: Organization
change note:
  comment: initial version
  created: 2020-09-24T09:56:30-05:00
  creator: Laura Ramirez
definition: See Handbook of Texas Online entry (accessed 2020-24-09): https://www.tshaonline.org/handbook/entries/texas-equal-suffrage-association